make[4]: Entering directory '/build/lede-17.01/slaves/phase2/arc_arc700/build/sdk/build_dir/target-arc_arc700_uClibc-1.0.14/xfsprogs-3.1.7'
/usr/bin/make --no-print-directory Q= include libxfs libxlog libxcmd libhandle libdisk copy db estimate fsck fsr growfs io logprint mkfs quota mdrestore repair rtcp m4 man doc debian
Building include
/usr/bin/make --no-print-directory Q= -q -C include || /usr/bin/make --no-print-directory Q= -C include
Building libxfs
/usr/bin/make --no-print-directory Q= -q -C libxfs || /usr/bin/make --no-print-directory Q= -C libxfs
Building libxlog
/usr/bin/make --no-print-directory Q= -q -C libxlog || /usr/bin/make --no-print-directory Q= -C libxlog
Building libxcmd
/usr/bin/make --no-print-directory Q= -q -C libxcmd || /usr/bin/make --no-print-directory Q= -C libxcmd
Building libhandle
/usr/bin/make --no-print-directory Q= -q -C libhandle || /usr/bin/make --no-print-directory Q= -C libhandle
Building libdisk
/usr/bin/make --no-print-directory Q= -q -C libdisk || /usr/bin/make --no-print-directory Q= -C libdisk
Building copy
/usr/bin/make --no-print-directory Q= -q -C copy || /usr/bin/make --no-print-directory Q= -C copy
Building db
/usr/bin/make --no-print-directory Q= -q -C db || /usr/bin/make --no-print-directory Q= -C db
    [LD]     xfs_db
/bin/bash ../libtool --quiet --tag=CC --mode=link ccache_cc -o xfs_db -L/build/lede-17.01/slaves/phase2/arc_arc700/build/sdk/staging_dir/target-arc_arc700_uClibc-1.0.14/usr/lib -L/build/lede-17.01/slaves/phase2/arc_arc700/build/sdk/staging_dir/target-arc_arc700_uClibc-1.0.14/lib -L/build/lede-17.01/slaves/phase2/arc_arc700/build/sdk/staging_dir/toolchain-arc_arc700_gcc-arc-2016.03_uClibc-1.0.14/usr/lib -L/build/lede-17.01/slaves/phase2/arc_arc700/build/sdk/staging_dir/toolchain-arc_arc700_gcc-arc-2016.03_uClibc-1.0.14/lib -znow -zrelro -L/build/lede-17.01/slaves/phase2/arc_arc700/build/sdk/staging_dir/target-arc_arc700_uClibc-1.0.14/usr/lib/libiconv-stub/lib -Wl,-rpath-link=/build/lede-17.01/slaves/phase2/arc_arc700/build/sdk/staging_dir/target-arc_arc700_uClibc-1.0.14/usr/lib/libiconv-stub/lib -L/build/lede-17.01/slaves/phase2/arc_arc700/build/sdk/staging_dir/target-arc_arc700_uClibc-1.0.14/usr/lib/libintl-stub/lib -Wl,-rpath-link=/build/lede-17.01/slaves/phase2/arc_arc700/build/sdk/staging_dir/target-arc_arc700_uClibc-1.0.14/usr/lib/libintl-stub/lib  -L/build/lede-17.01/slaves/phase2/arc_arc700/build/sdk/staging_dir/target-arc_arc700_uClibc-1.0.14/usr/lib -L/build/lede-17.01/slaves/phase2/arc_arc700/build/sdk/staging_dir/target-arc_arc700_uClibc-1.0.14/lib -L/build/lede-17.01/slaves/phase2/arc_arc700/build/sdk/staging_dir/toolchain-arc_arc700_gcc-arc-2016.03_uClibc-1.0.14/usr/lib -L/build/lede-17.01/slaves/phase2/arc_arc700/build/sdk/staging_dir/toolchain-arc_arc700_gcc-arc-2016.03_uClibc-1.0.14/lib -znow -zrelro -L/build/lede-17.01/slaves/phase2/arc_arc700/build/sdk/staging_dir/target-arc_arc700_uClibc-1.0.14/usr/lib/libiconv-stub/lib -Wl,-rpath-link=/build/lede-17.01/slaves/phase2/arc_arc700/build/sdk/staging_dir/target-arc_arc700_uClibc-1.0.14/usr/lib/libiconv-stub/lib -L/build/lede-17.01/slaves/phase2/arc_arc700/build/sdk/staging_dir/target-arc_arc700_uClibc-1.0.14/usr/lib/libintl-stub/lib -Wl,-rpath-link=/build/lede-17.01/slaves/phase2/arc_arc700/build/sdk/staging_dir/target-arc_arc700_uClibc-1.0.14/usr/lib/libintl-stub/lib   -L/build/lede-17.01/slaves/phase2/arc_arc700/build/sdk/staging_dir/target-arc_arc700_uClibc-1.0.14/usr/lib -L/build/lede-17.01/slaves/phase2/arc_arc700/build/sdk/staging_dir/target-arc_arc700_uClibc-1.0.14/lib -L/build/lede-17.01/slaves/phase2/arc_arc700/build/sdk/staging_dir/toolchain-arc_arc700_gcc-arc-2016.03_uClibc-1.0.14/usr/lib -L/build/lede-17.01/slaves/phase2/arc_arc700/build/sdk/staging_dir/toolchain-arc_arc700_gcc-arc-2016.03_uClibc-1.0.14/lib -znow -zrelro -L/build/lede-17.01/slaves/phase2/arc_arc700/build/sdk/staging_dir/target-arc_arc700_uClibc-1.0.14/usr/lib/libiconv-stub/lib -Wl,-rpath-link=/build/lede-17.01/slaves/phase2/arc_arc700/build/sdk/staging_dir/target-arc_arc700_uClibc-1.0.14/usr/lib/libiconv-stub/lib -L/build/lede-17.01/slaves/phase2/arc_arc700/build/sdk/staging_dir/target-arc_arc700_uClibc-1.0.14/usr/lib/libintl-stub/lib -Wl,-rpath-link=/build/lede-17.01/slaves/phase2/arc_arc700/build/sdk/staging_dir/target-arc_arc700_uClibc-1.0.14/usr/lib/libintl-stub/lib   -L/build/lede-17.01/slaves/phase2/arc_arc700/build/sdk/staging_dir/target-arc_arc700_uClibc-1.0.14/usr/lib -L/build/lede-17.01/slaves/phase2/arc_arc700/build/sdk/staging_dir/target-arc_arc700_uClibc-1.0.14/lib -L/build/lede-17.01/slaves/phase2/arc_arc700/build/sdk/staging_dir/toolchain-arc_arc700_gcc-arc-2016.03_uClibc-1.0.14/usr/lib -L/build/lede-17.01/slaves/phase2/arc_arc700/build/sdk/staging_dir/toolchain-arc_arc700_gcc-arc-2016.03_uClibc-1.0.14/lib -znow -zrelro -L/build/lede-17.01/slaves/phase2/arc_arc700/build/sdk/staging_dir/target-arc_arc700_uClibc-1.0.14/usr/lib/libiconv-stub/lib -Wl,-rpath-link=/build/lede-17.01/slaves/phase2/arc_arc700/build/sdk/staging_dir/target-arc_arc700_uClibc-1.0.14/usr/lib/libiconv-stub/lib -L/build/lede-17.01/slaves/phase2/arc_arc700/build/sdk/staging_dir/target-arc_arc700_uClibc-1.0.14/usr/lib/libintl-stub/lib -Wl,-rpath-link=/build/lede-17.01/slaves/phase2/arc_arc700/build/sdk/staging_dir/target-arc_arc700_uClibc-1.0.14/usr/lib/libintl-stub/lib  -static  addr.o agf.o agfl.o agi.o attr.o attrshort.o bit.o block.o bmap.o btblock.o bmroot.o check.o command.o convert.o debug.o dir.o dir2.o dir2sf.o dirshort.o dquot.o echo.o faddr.o field.o flist.o fprint.o frag.o freesp.o hash.o help.o init.o inode.o input.o io.o malloc.o metadump.o output.o print.o quit.o sb.o sig.o strvec.o text.o type.o write.o attrset.o   ../libxfs/libxfs.la ../libxlog/libxlog.la -luuid -lrt -lpthread  
malloc.o: In function `xmalloc':
/build/lede-17.01/slaves/phase2/arc_arc700/build/sdk/build_dir/target-arc_arc700_uClibc-1.0.14/xfsprogs-3.1.7/db/malloc.c:59: undefined reference to `valloc'
collect2: error: ld returned 1 exit status
../include/buildrules:43: recipe for target 'xfs_db' failed
make[6]: *** [xfs_db] Error 1
include/buildrules:22: recipe for target 'db' failed
make[5]: *** [db] Error 2
Makefile:52: recipe for target 'default' failed
make[4]: *** [default] Error 2
make[4]: Leaving directory '/build/lede-17.01/slaves/phase2/arc_arc700/build/sdk/build_dir/target-arc_arc700_uClibc-1.0.14/xfsprogs-3.1.7'
Makefile:87: recipe for target '/build/lede-17.01/slaves/phase2/arc_arc700/build/sdk/build_dir/target-arc_arc700_uClibc-1.0.14/xfsprogs-3.1.7/.built' failed
make[3]: *** [/build/lede-17.01/slaves/phase2/arc_arc700/build/sdk/build_dir/target-arc_arc700_uClibc-1.0.14/xfsprogs-3.1.7/.built] Error 2